{"text_format":"1","workbook":"xlsx","n_sheets":17,"sheets":["Tipo1 - Info Fideicomiso","Tipo2 - Info Fideicomitente","Tipo3 - Info Beneficiario","Validacion","LogErrores","Copia","Instructivo","TablaResumen","Versionador","Vigencia","Tipos-Subtipos-Fideicomiso","HomologacionDireccion","CIIU","Tipos Documento identidad","Departamentos - Municipios","Tipos de participación","Tipos Obligado"],"not_rendered":{"charts":0,"images":0,"macros":1,"external_links":0,"defined_names":59,"comments":0,"pivot_tables":1},"unopened":[],"bounds":{"document_bytes":16777216,"sheet_cells":100000,"rows_first":2000,"rows_last":500,"rows_between":2000,"halvings":0,"cell_chars":16384,"cell_head_chars":4096},"cells_cut":0,"cells_raw":0,"read":"whole","date_system":"1900"}

{"sheet":"Tipo1 - Info Fideicomiso","index":0,"n_rows":2001,"n_cols":12,"rows_kept":2001,"cut":false,"hidden":false,"merged":[]}
["Vigencia","NumeroFideicomiso","TipoFideicomiso","Tipo de fideicomiso","SubtipoFideicomiso","Subtipo de Fideicomiso","IngresoBrutosFueraJurisdiccion","IngresoBrutosJurisdiccion","CodigoCIIU","Descripción Código CIIU","FechaConstitucionFideicomiso(AAAAMMDD)","FechaFinalizacionFideicomiso(AAAAMMDD)"]
[null,null,3,null,32,null,null,null,null,{"$f":"IFERROR(VLOOKUP(I2,CIIU!A:B,2,0),\"\")","v":""}]
[null,null,2,null,21,null,null,null,null,{"$f":"IFERROR(VLOOKUP(I3,CIIU!A:B,2,0),\"\")","v":""}]
[null,null,2,null,21,null,null,null,null,{"$f":"IFERROR(VLOOKUP(I4,CIIU!A:B,2,0),\"\")","v":""}]
[null,null,2,null,21,null,null,null,null,{"$f":"IFERROR(VLOOKUP(I5,CIIU!A:B,2,0),\"\")","v":""}]
[null,null,2,null,21,null,null,null,null,{"$f":"IFERROR(VLOOKUP(I6,CIIU!A:B,2,0),\"\")","v":""}]
[null,null,2,null,21,null,null,null,null,{"$f":"IFERROR(VLOOKUP(I7,CIIU!A:B,2,0),\"\")","v":""}]
[null,null,2,null,21,null,null,null,null,{"$f":"IFERROR(VLOOKUP(I8,CIIU!A:B,2,0),\"\")","v":""}]
[null,null,2,null,21,null,null,null,null,{"$f":"IFERROR(VLOOKUP(I9,CIIU!A:B,2,0),\"\")","v":""}]
[null,null,2,null,21,null,null,null,null,{"$f":"IFERROR(VLOOKUP(I10,CIIU!A:B,2,0),\"\")","v":""}]
[null,null,2,null,21,null,null,null,null,{"$f":"IFERROR(VLOOKUP(I11,CIIU!A:B,2,0),\"\")","v":""}]
[null,null,3,null,31,null,null,null,null,{"$f":"IFERROR(VLOOKUP(I12,CIIU!A:B,2,0),\"\")","v":""}]
[null,null,3,null,31,null,null,null,null,{"$f":"IFERROR(VLOOKUP(I13,CIIU!A:B,2,0),\"\")","v":""}]
[null,null,3,null,31,null,null,null,null,{"$f":"IFERROR(VLOOKUP(I14,CIIU!A:B,2,0),\"\")","v":""}]
[null,null,3,null,31,null,null,null,null,{"$f":"IFERROR(VLOOKUP(I15,CIIU!A:B,2,0),\"\")","v":""}]
{"$rows_left_out":1987}
{"sheet":"Tipo2 - Info Fideicomitente","index":1,"n_rows":102,"n_cols":26,"rows_kept":102,"cut":false,"hidden":false,"merged":[[0,8,0,17],[1,8,1,11],[1,12,1,14],[1,15,1,17]]}
[null,null,null,null,null,null,null,null,"Dirección notificación"]
[null,null,null,null,null,null,null,null,"Datos de la via",null,null,null,"Datos del cruce",null,null,"Datos adicionales"]
["NumeroFideicomiso","TipoIdentificacion","Tipo Identificación Fideicomitente","NumeroIdentificacion","Nombre1","Nombre2","Apellido1","Apellido2","Tipo","Numero1","Apendice1","Orientacion1","Numero2","Apendice2","Orientacion2","Placa","Interior","Bloque","DireccionEspecial","CodDpto","Departamento","CodMpio","Municipio","TipoParticipacion","Tipo Participación","PorcentajeParticipacion"]
[null,1,null,null,null,null,null,null,null,null,null,null,null,null,null,null,null,null,null,"11",null,"11001",null,2]
[null,1,null,null,null,null,null,null,null,null,null,null,null,null,null,null,null,null,null,"05",null,"05001",null,2]
[null,1,null,null,null,null,null,null,null,null,null,null,null,null,null,null,null,null,null,"05",null,"05001",null,2]
[null,1,null,null,null,null,null,null,null,null,null,null,null,null,null,null,null,null,null,"05",null,"05001",null,2]
[null,1,null,null,null,null,null,null,null,null,null,null,null,null,null,null,null,null,null,"05",null,"05001",null,2]
[null,1,null,null,null,null,null,null,null,null,null,null,null,null,null,null,null,null,null,"05",null,"05001",null,2]
[null,1,null,null,null,null,null,null,null,null,null,null,null,null,null,null,null,null,null,"05",null,"05266",null,2]
[null,1,null,null,null,null,null,null,null,null,null,null,null,null,null,null,null,null,null,"05",null,"05266",null,2]
[null,1,null,null,null,null,null,null,null,null,null,null,null,null,null,null,null,null,null,"05",null,"05001",null,2]
[null,1,null,null,null,null,null,null,null,null,null,null,null,null,null,null,null,null,null,"05",null,"05001",null,2]
[null,1,null,null,null,null,null,null,null,null,null,null,null,null,null,null,null,null,null,"05",null,"05001",null,2]
[null,1,null,null,null,null,null,null,null,null,null,null,null,null,null,null,null,null,null,"05",null,"05001",null,2]
{"$rows_left_out":88}
{"sheet":"Tipo3 - Info Beneficiario","index":2,"n_rows":102,"n_cols":26,"rows_kept":102,"cut":false,"hidden":false,"merged":[[0,8,0,17],[1,8,1,11],[1,12,1,14],[1,15,1,17]]}
[null,null,null,null,null,null,null,null,"Dirección notificación"]
[null,null,null,null,null,null,null,null,"Datos de la via",null,null,null,"Datos del cruce",null,null,"Datos adicionales"]
["NumeroFideicomiso","TipoIdentificacion","Tipo Identificación Beneficiario","NumeroIdentificacion","Nombre1","Nombre2","Apellido1","Apellido2","Tipo","Numero1","Apendice1","Orientacion1","Numero2","Apendice2","Orientacion2","Placa","Interior","Bloque","DireccionEspecial","CodDpto","Departamento","CodMpio","Municipio","TipoParticipacion","Tipo Participación","PorcentajeParticipacion"]
[null,1,null,null,null,null,null,null,null,null,null,null,null,null,null,null,null,null,null,"11",null,"11001",null,2]
[null,1,null,null,null,null,null,null,null,null,null,null,null,null,null,null,null,null,null,"05",null,"05001",null,2]
[null,1,null,null,null,null,null,null,null,null,null,null,null,null,null,null,null,null,null,"05",null,"05001",null,2]
[null,1,null,null,null,null,null,null,null,null,null,null,null,null,null,null,null,null,null,"05",null,"05001",null,2]
[null,1,null,null,null,null,null,null,null,null,null,null,null,null,null,null,null,null,null,"05",null,"05001",null,2]
[null,1,null,null,null,null,null,null,null,null,null,null,null,null,null,null,null,null,null,"05",null,"05001",null,2]
[null,1,null,null,null,null,null,null,null,null,null,null,null,null,null,null,null,null,null,"05",null,"05266",null,2]
[null,1,null,null,null,null,null,null,null,null,null,null,null,null,null,null,null,null,null,"05",null,"05266",null,2]
[null,1,null,null,null,null,null,null,null,null,null,null,null,null,null,null,null,null,null,"05",null,"05001",null,2]
[null,1,null,null,null,null,null,null,null,null,null,null,null,null,null,null,null,null,null,"05",null,"05001",null,2]
[null,1,null,null,null,null,null,null,null,null,null,null,null,null,null,null,null,null,null,"05",null,"05001",null,2]
[null,1,null,null,null,null,null,null,null,null,null,null,null,null,null,null,null,null,null,"05",null,"05001",null,2]
{"$rows_left_out":88}
{"sheet":"Validacion","index":3,"n_rows":2001,"n_cols":10,"rows_kept":2001,"cut":false,"hidden":false,"merged":[[0,0,0,1],[1,0,1,1]]}
["MUNICIPIO DE MEDELLIN"]
["Validador Información Exógena",null,null,null,null,null,null,null,null,{"$f":"IFERROR(VLOOKUP(I2,CIIU!A:B,2,0),\"\")","v":""}]
["Seleccionar tipo de estructura a validar","Tipo3 - Info Beneficiario",null,null,null,null,null,null,null,{"$f":"IFERROR(VLOOKUP(I3,CIIU!A:B,2,0),\"\")","v":""}]
["Estado Validación","Validado Exitosamente",null,null,null,null,null,null,null,{"$f":"IFERROR(VLOOKUP(I4,CIIU!A:B,2,0),\"\")","v":""}]
["Acciones",null,null,null,null,null,null,null,null,{"$f":"IFERROR(VLOOKUP(I5,CIIU!A:B,2,0),\"\")","v":""}]
[null,null,null,null,null,null,null,null,null,{"$f":"IFERROR(VLOOKUP(I6,CIIU!A:B,2,0),\"\")","v":""}]
[null,null,null,null,null,null,null,null,null,{"$f":"IFERROR(VLOOKUP(I7,CIIU!A:B,2,0),\"\")","v":""}]
[null,null,null,null,null,null,null,null,null,{"$f":"IFERROR(VLOOKUP(I8,CIIU!A:B,2,0),\"\")","v":""}]
[null,null,null,null,null,null,null,null,null,{"$f":"IFERROR(VLOOKUP(I9,CIIU!A:B,2,0),\"\")","v":""}]
[null,null,null,null,null,null,null,null,null,{"$f":"IFERROR(VLOOKUP(I10,CIIU!A:B,2,0),\"\")","v":""}]
[null,null,null,null,null,null,null,null,null,{"$f":"IFERROR(VLOOKUP(I11,CIIU!A:B,2,0),\"\")","v":""}]
[null," ",null,null,null,null,null,null,null,{"$f":"IFERROR(VLOOKUP(I12,CIIU!A:B,2,0),\"\")","v":""}]
[null,null,null,null,null,null,null,null,null,{"$f":"IFERROR(VLOOKUP(I13,CIIU!A:B,2,0),\"\")","v":""}]
[null,null,null,null,null,null,null,null,null,{"$f":"IFERROR(VLOOKUP(I14,CIIU!A:B,2,0),\"\")","v":""}]
[null,null,null,null,null,null,null,null,null,{"$f":"IFERROR(VLOOKUP(I15,CIIU!A:B,2,0),\"\")","v":""}]
{"$rows_left_out":1987}
{"sheet":"LogErrores","index":4,"n_rows":1,"n_cols":2,"rows_kept":1,"cut":false,"hidden":false,"merged":[]}
["Log de Errores","Tipo3 - Info Beneficiario"]

{"sheet":"Copia","index":5,"n_rows":100,"n_cols":26,"rows_kept":100,"cut":false,"hidden":true,"merged":[]}
["NumeroFideicomiso","TipoIdentificacion","Tipo Identificación Beneficiario","NumeroIdentificacion","Nombre1","Nombre2","Apellido1","Apellido2","Tipo","Numero1","Apendice1","Orientacion1","Numero2","Apendice2","Orientacion2","Placa","Interior","Bloque","DireccionEspecial","CodDpto","Departamento","CodMpio","Municipio","TipoParticipacion","Tipo Participación","PorcentajeParticipacion"]
[34241,1,"NIT",800176602,"INVERSIONES Y ESTRATEGIAS CORPORATIVAS SAS",null,null,0,"CR",124,"A",null,99,null,null,2,808,null,null,"11","BOGOTA","11001","BOGOTA, D.C.",2,"Privada",100]
[27644,1,"NIT",800170978,"FAJARDO WILLIAMSON SA",null,null,null,"CR",43,null,null,16,null,"Sur",38,null,null,null,"05","ANTIOQUIA","05001","MEDELLIN",2,"Privada",30]
[27644,1,"NIT",811000331,"CU PROMOTORA SAS",null,null,null,"CR",39,null,null,198,"A",null,95,208,null,null,"05","ANTIOQUIA","05001","MEDELLIN",2,"Privada",10]
[27644,1,"NIT",890937515,"ESTRUCTURAR SA",null,null,null,"CL",11,"C",null,31,null,null,99,null,null,"Next Avenue","05","ANTIOQUIA","05001","MEDELLIN",2,"Privada",30]
[27644,1,"NIT",890940026,"FAJARDO MORENO Y CIA SAS EN LIQUIDACION",null,null,null,"CL",7,null,"Sur",42,null,null,70,null,null,null,"05","ANTIOQUIA","05001","MEDELLIN",2,"Privada",30]
[219392,1,"NIT",900377602,"Q TOWER SAS",null,null,null,"CR",33,null,"Sur",1,null,"Sur",45,null,null,"ESQUINA 3","05","ANTIOQUIA","05001","MEDELLIN",2,"Privada",100]
[220396,1,"NIT",900027767,"PROMOTORA  QU4TRO SAS",null,null,null,"CR",33,null,null,1,null,null,55,null,null,null,"05","ANTIOQUIA","05266","ENVIGADO",2,"Privada",100]
[230528,1,"NIT",900027767,"PROMOTORA QU4TRO SAS",null,null,null,null,null,null,null,null,null,null,null,null,null,"Km 17 vias palmas aldea palmas 6","05","ANTIOQUIA","05266","ENVIGADO",2,"Privada",100]
[27848,1,"NIT",900027767,"PROMOTORA QU4TRO SAS",null,null,null,null,null,null,null,null,null,null,null,null,null,"Km 17 vias palmas aldea palmas 6","05","ANTIOQUIA","05001","MEDELLIN",2,"Privada",100]
[274074,1,"NIT",811037405,"CENTRO SUR SA",null,null,null,"CR",27,null,null,7,"B",null,145,2302,null,null,"05","ANTIOQUIA","05001","MEDELLIN",2,"Privada",100]
[278565,1,"NIT",890929956,"DE LA ROCHE M Y CIA LTDA",null,null,null,"CL",10,"B",null,22,null,null,10,1701,null,null,"05","ANTIOQUIA","05001","MEDELLIN",2,"Privada",100]
[312790,1,"NIT",860058070,"CONSTRUCTORA COLPATRIA SA",null,null,null,"CR",43,"A",null,7,null,null,50,1101,null,null,"05","ANTIOQUIA","05001","MEDELLIN",2,"Privada",100]
[36717,1,"NIT",860058070,"CONSTRUCTORA COLPATRIA SA",null,null,null,"CR",37,"B","Sur",28,"C","SUR",1,null,null,null,"05","ANTIOQUIA","05001","MEDELLIN",2,"Privada",100]
[248192,1,"NIT",900945588,"Q OFFICE SAS",null,null,null,"CL",6,null,null,26,null,null,5,1206,null,null,"05","ANTIOQUIA","05001","MEDELLIN",2,"Privada",100]
{"$rows_left_out":86}
{"sheet":"Instructivo","index":6,"n_rows":7,"n_cols":7,"rows_kept":7,"cut":false,"hidden":true,"merged":[[6,0,7,6],[1,0,1,6],[0,0,0,6]]}
["La administración tributaria municipal mediante la Resolución 35189 de 2017, en su artículo 3 establece que: Las sociedades fiduciarias que administren patrimonios autónomos y/o encargos fiduciarios que desarrollen actividades gravadas en el Municipio de Medellín, deberán informar bajo su propio NIT y razón social, según lo dispuesto a continuación:"]
[]
["GENERALIDADES",null,"Información que deben reportar las Sociedades Fiduciarias que administren patrimonios autónomos",null,"Determinación del(de los) fideicomitente(s) con los siguientes datos:",null,"Determinación del(de los) beneficiario(s) con los siguientes datos:"]
[null,null,"Estructura tipo 1 - Información del Fideicomiso",null,"Estructura tipo 2 - Información de los fideicomitentes",null,"Estructura tipo 3 - Información de los beneficiarios"]
["De conformidad con el artículo 631 del Estatuto Tributario Nacional, que busca efectuar estudios y cruces de información necesarios para el debido control de los tributos municipales y el cual consagra la facultad de la Administración Tributaria para solicitar a las personas o entidades, contribuyentes y no contribuyentes, declarantes o no declarantes; información relacionada con sus propias operaciones o con operaciones efectuadas con terceros, así como la discriminación total o parcial de las partidas consignadas en los formularios de las declaraciones tributarias.\n\nEl Estatuto Tributario Municipal –Acuerdo 066 de 2017, por medio del cual se expide la normativa sustantiva aplicable a los ingresos tributarios en el Municipio de Medellín, determina que las sociedades fiduciarias que administren patrimonios autónomos reportar información a la administración tributaria municipal.",null,"1. Vigencia, conforme a la información que esté reportando\n2. Número de fideicomiso mediante el cual se informa a la Superintendencia Financiera de Colombia\n3. El tipo de fideicomiso según la clasificación de negocios fiduciarios junto con el subtipo de fideicomiso según la clasificación de negocios fiduciarios\n4. Ingresos brutos del fideicomiso fuera de Medellín, es decir, en otras jurisdicciones \n5. Ingresos brutos del fideicomiso en Medellín, es decir, en la jurisdicción\n6. Fecha constitución del fideicomiso\n7. Fecha finalización del fideicomiso\n",null,"1. Número de fideicomiso, el cual debe ser coincidente con el código reportado en la estructura tipo 1\n2.  Tipo de documento de identificación del(los) fideicomitente(s)\n3.  Número de Identificación de(l) (los) fideicomitente(s)\n4.  Nombre(s) y apellido(s) o razón social de(l) (los) fideicomitente(s)\n5.  Dirección de notificación de(l) (los) fideicomitente(s)\n6.  Código de ciudad o municipio (Homologación DIAN)\n7.  Código de departamento (Homologación DIAN)\n8. Tipo de participación de(l) (los) fideicomitentes(s)\n9.  Porcentaje de participación del(los) fideicomitente(s)\n10.  Valor absoluto de la participación del(los) fideicomitente(s) - No diligenciar, este valor se calcula automáticamente con base en el porcentaje de participación (Campo 9 es esta estructura) y el valor de los ingresos brutos fideicomiso en Medellín (Campo 5 de estructura 1)\nAl momento de incluir información en la hoja estructura tipo 2, los campos documento, municipio, departamento, tipo de participación y tipo de obligado fiscal se diligencian a través de selección, por lo tanto únicamente serán válidos los ítem que contenga cada uno de estos campos. En el caso de municipios y departamentos, en este archivo se mostrarán los nombres para su respectiva selección, no obstante al generar la información en las respectivas estructuras, se convertirán a códigos DANE",null,"1. Número de fideicomiso, el cual debe ser coincidente con el código reportado en la estructura tipo 1\n2.  Tipo de documento de identificación del(los) beneficiario(s)\n3.  Número de Identificación de(l) (los) beneficiario(s)\n4.  Nombre(s) y apellido(s) o razón social de(l) (los) beneficiario(s)\n5.  Dirección de notificación de(l) (los) beneficiario(s)\n6.  Código de ciudad o municipio (Homologación DIAN)\n7.  Código de departamento (Homologación DIAN)\n8. Tipo de participación de(l) (los) beneficiarios(s)\n9.  Porcentaje de participación del(los) beneficiario(s)\n10.  Valor absoluto de la participación del(los) beneficiarios(s) - No diligenciar, este valor se calcula automáticamente con base en el porcentaje de participación (Campo 9 es esta estructura) y el valor de los ingresos brutos fideicomiso en Medellín (Campo 5 de estructura 1)\nAl momento de incluir información en la hoja estructura tipo 3, los campos documento, municipio, departamento, tipo de participación y tipo de obligado fiscal se diligencian a través de selección, por lo tanto únicamente serán válidos los ítem que contenga cada uno de estos campos. En el caso de municipios y departamentos, en este archivo se mostrarán los nombres para su respectiva selección, no obstante al generar la información en las respectivas estructuras, se convertirán a códigos DANE"]
[]
["Luego de diligenciar las formatos tipo 1, 2 y 3, para generar las estructuras con los datos requeridos, se debe acceder a la hoja Validación, donde existe un listado en el cual se elige el tipo de estructura que se desea obtener, para efectuar el proceso de validación de dicha información y finalmente cuando las validaciones sean satisfactorias, se genera la estructura a través del botón exportar, se genera el archivo CSV con el respectivo nombre en la misma ruta donde se tiene almacenado este validador. Es importante generar un CSV por cada tipo de archivo."]

{"sheet":"TablaResumen","index":7,"n_rows":68,"n_cols":2,"rows_kept":68,"cut":false,"hidden":true,"merged":[]}
[]
[]
["Etiquetas de fila","Suma de PorcentajeParticipacion"]
[26579,100]
[26631,100]
[26674,100]
[26708,100]
[27575,100]
[27644,100]
[27848,100]
[28511,100]
[28684,100]
[34241,100]
[36545,100]
[36717,100]
{"$rows_left_out":54}
{"sheet":"Versionador","index":8,"n_rows":5,"n_cols":3,"rows_kept":5,"cut":false,"hidden":true,"merged":[]}
[]
["VERSION","FECHA","DESCRIPCION"]
["1,0",null,"se implementa los validares tipo1-Info Fideicomiso , tipo2-Info Fideicomitente, tipo3- InfoBeneficiario"]
["2,0","2021-02-17","Ajustes Validaror Tipo1-Inf Fideicomiso"]
[null,null,"* se ajuste Validacion del campo \"Tipo Fideicomiso\" que está validando en forma erronea (Macro calculo())"]

{"sheet":"Vigencia","index":9,"n_rows":4,"n_cols":1,"rows_kept":4,"cut":false,"hidden":true,"merged":[]}
["Vigencia"]
[2018]
[2019]
[2020]

{"sheet":"Tipos-Subtipos-Fideicomiso","index":10,"n_rows":40,"n_cols":5,"rows_kept":40,"cut":false,"hidden":true,"merged":[[27,0,28,0],[29,0,30,0],[1,0,1,3],[0,0,0,3],[3,0,10,0],[11,0,14,0],[15,0,19,0],[20,0,22,0],[24,0,26,0],[29,1,30,1],[3,1,10,1],[11,1,14,1],[15,1,19,1],[20,1,22,1],[24,1,26,1],[27,1,28,1]]}
["Tipos y subtipos de fideicomiso"]
["Fuente información: Superintendencia bancaria de Colombia, https://www.superfinanciera.gov.co/SFCant/Normativa/IndicedeReportesdeSuperf/cc110.pdf"]
["IdTipo","Tipo","IdSubtipo","Subtipo","IdSubtipo"]
[1,"Inversión",1,"Inversión - Fondo común ordinario",11]
[null,null,2,"Inversión - Fondo común especial",12]
[null,null,3,"Inversión - Fondo común especial - Resultado proceso de titularización",13]
[null,null,4,"Inversión - Fondo común especial en moneda extranjera",14]
[null,null,5,"Inversión - Fideicomiso de inversión con destinación especifica",15]
[null,null,7,"Inversión - Fondos mutuos de inversión",17]
[null,null,8,"Inversión - Otros fideicomisos de inversión",18]
[null,null,9,"Inversión - Otros Fondos",19]
[2,"Inmobiliario",1,"Inmobiliario - Proyectos de construcción",21]
[null,null,2,"Inmobiliario - Administración y pagos",22]
[null,null,3,"Inmobiliario - Tesorería",23]
[null,null,4,"Inmobiliario - Administración",24]
{"$rows_left_out":26}
{"sheet":"HomologacionDireccion","index":11,"n_rows":21,"n_cols":12,"rows_kept":21,"cut":false,"hidden":true,"merged":[[8,2,8,11],[9,2,9,5],[9,6,9,8],[9,9,9,11]]}
[]
[]
[]
[]
[]
[]
[]
[]
[null,null,"Direccion encasillada"]
[null,null," Datos de la via ",null,null,null," Datos del cruce ",null,null," Datos adicionales "]
[null,null," Tipo"," Número"," Apendice"," Orientación"," Número"," Apendice"," Orientación"," Placa"," Interior"," Bloque"]
[null,null," Desplegable con esta opciones "," ENTRE 1 Y 3 CARACTERES, NÚMERICO "," ENTRE 1 Y DOS CARACTERES, TIPO TEXTO "," Desplegable con esta opciones "," ENTRE 1 Y 3 CARACTERES, NÚMERICO "," ENTRE 1 Y DOS CARACTERES, TIPO TEXTO "," Desplegable con esta opciones "," ENTRE 1 Y 3 CARACTERES, NÚMERICO ","ENTRE 1 Y 4 CARACTERES, TIPO TEXO"," Entre 1 y 2 caracteres, Tipo alfanúmerico "]
[null,null,"CR",null,null,"Sur",null,null,"Sur"]
[null,null,"CL",null,null,"Norte",null,null,"Norte"]
[null,null,"CQ",null,null,"Oriente",null,null,"Oriente"]
{"$rows_left_out":7}
{"sheet":"CIIU","index":12,"n_rows":562,"n_cols":4,"rows_kept":562,"cut":false,"hidden":true,"merged":[]}
[]
[]
[null,"TIPOS DE CODIGOS CIIU"]
["Código","Descripción","Código"]
[]
[510,"Extracción de hulla (carbón de piedra)",510]
[520,"Extracción de carbón lignito",520]
[610,"Extracción de petróleo crudo",610]
[620,"Extracción de gas natural",620]
[710,"Extracción de minerales de hierro",710]
[721,"Extracción de minerales de uranio y de torio",721]
[722,"Extracción de oro y otros metales preciosos",722]
[723,"Extracción de minerales de níquel",723]
[729,"Extracción de otros minerales metalíferos no ferrosos n.c.p.",729]
[811,"Extracción de piedra, arena, arcillas comunes, yeso y anhidrita",811]
{"$rows_left_out":548}
{"sheet":"Tipos Documento identidad","index":13,"n_rows":8,"n_cols":3,"rows_kept":8,"cut":false,"hidden":true,"merged":[[0,0,0,1]]}
["Tipos de documento"]
["Id","Tipo documento"]
["1","NIT","1"]
["2","Cédula de ciudadanía","2"]
["3","Cédula de extranjería","3"]
["4","Pasaporte","4"]
["5","Tarjeta de identidad","5"]
["6","Otros","6"]

{"sheet":"Departamentos - Municipios","index":14,"n_rows":1160,"n_cols":6,"rows_kept":1160,"cut":false,"hidden":true,"merged":[[1,0,3,0],[1,1,3,1],[1,3,3,3],[1,4,3,4],[0,0,0,4]]}
["Fuente información: Listado de departamentos y Municipios DANE, https://www.dane.gov.co/files/censos/.../NBI_total_cab_resto_mpio_nal_31dic08.xls"]
["Código Departamento","Nombre Departamento",null,"Código Municipio","Nombre Municipio"]
[]
[]
["05","ANTIOQUIA","05","05001","MEDELLIN",{"$f":"D5","v":"05001"}]
["05","ANTIOQUIA","05","05002","ABEJORRAL",{"$f":"D6","v":"05002"}]
["05","ANTIOQUIA","05","05004","ABRIAQUI","05004"]
["05","ANTIOQUIA","05","05021","ALEJANDRIA","05021"]
["05","ANTIOQUIA","05","05030","AMAGA","05030"]
["05","ANTIOQUIA","05","05031","AMALFI","05031"]
["05","ANTIOQUIA","05","05034","ANDES","05034"]
["05","ANTIOQUIA","05","05036","ANGELOPOLIS","05036"]
["05","ANTIOQUIA","05","05038","ANGOSTURA","05038"]
["05","ANTIOQUIA","05","05040","ANORI","05040"]
["05","ANTIOQUIA","05","05042","SANTAFE DE ANTIOQUIA","05042"]
{"$rows_left_out":1146}
{"sheet":"Tipos de participación","index":15,"n_rows":4,"n_cols":3,"rows_kept":4,"cut":false,"hidden":true,"merged":[[0,0,0,1]]}
["Tipos de participación"]
["Id","Tipo de participación"]
[1,"Pública",1]
[2,"Privada",2]

{"sheet":"Tipos Obligado","index":16,"n_rows":4,"n_cols":3,"rows_kept":4,"cut":false,"hidden":true,"merged":[[0,0,0,1]]}
["Tipo Obligado"]
["Id","Tipo obligado"]
[1,"Obligado Fiscal",1]
[2,"Obligado solidario",2]