{"text_format":"1","workbook":"xlsx","n_sheets":7,"sheets":["HomologacionDireccion","ContratoColaboracionEmpresarial","LogErrores","TiposContrato","Tipos Documento identidad","CIIU","Departamentos - Municipios"],"not_rendered":{"charts":0,"images":1,"macros":1,"external_links":2,"defined_names":59,"comments":0,"pivot_tables":0},"unopened":[],"bounds":{"document_bytes":16777216,"sheet_cells":100000,"rows_first":2000,"rows_last":500,"rows_between":2000,"halvings":0,"cell_chars":16384,"cell_head_chars":4096},"cells_cut":0,"cells_raw":0,"read":"whole","date_system":"1900"}

{"sheet":"HomologacionDireccion","index":0,"n_rows":21,"n_cols":12,"rows_kept":21,"cut":false,"hidden":true,"merged":[[8,2,8,11],[9,2,9,5],[9,6,9,8],[9,9,9,11]]}
[]
[]
[]
[]
[]
[]
[]
[]
[null,null,"Direccion encasillada"]
[null,null," Datos de la via ",null,null,null," Datos del cruce ",null,null," Datos adicionales "]
[null,null," Tipo"," Número"," Apendice"," Orientación"," Número"," Apendice"," Orientación"," Placa"," Interior"," Bloque"]
[null,null," Desplegable con esta opciones "," ENTRE 1 Y 3 CARACTERES, NÚMERICO "," ENTRE 1 Y DOS CARACTERES, TIPO TEXTO "," Desplegable con esta opciones "," ENTRE 1 Y 3 CARACTERES, NÚMERICO "," ENTRE 1 Y DOS CARACTERES, TIPO TEXTO "," Desplegable con esta opciones "," ENTRE 1 Y 3 CARACTERES, NÚMERICO ","ENTRE 1 Y 4 CARACTERES, TIPO TEXO"," Entre 1 y 2 caracteres, Tipo alfanúmerico "]
[null,null,"CR",null,null,"Sur",null,null,"Sur"]
[null,null,"CL",null,null,"Norte",null,null,"Norte"]
[null,null,"CQ",null,null,"Oriente",null,null,"Oriente"]
[null,null,"DG",null,null,"Occidente",null,null,"Occidente"]
[null,null,"AV",null,null,null,null,null,{"$f":"IF(F17<>\"\",F17,\"\")","v":""}]
[null,null,"TG",null,null,null,null,null,""]
[null,null,null,null,null,null,null,null,""]
[null,null,null,null,null,null,null,null,""]
[null,null,null,null,null,null,null,null,""]

{"sheet":"ContratoColaboracionEmpresarial","index":1,"n_rows":2003,"n_cols":28,"rows_kept":2003,"cut":false,"hidden":false,"merged":[[0,4,1,8],[1,9,1,10],[0,9,0,10],[2,13,2,22],[3,13,3,16],[3,17,3,19],[3,20,3,22]]}
[null,null,null,null,"SECRETARIA DE HACIENDA\nSUBSECRETARIA DE INGRESOS\nPREVALIDADOR CONTRATOS DE COLABORACIÓN EMPRESARIAL - RESOLUCION 202150001429 DE 2021",null,null,null,null,"Acciones",null,null,"Estado"]
[null,null,null,null,null,null,null,null,null,null,null,null,"Validado Exitosamente"]
[null,null,null,null,null,null,null,null,null,null,null,null,null,"Dirección notificación"]
[null,null,null,null,null,null,null,null,null,null,null,null,null,"Datos de la via",null,null,null,"Datos del cruce",null,null,"Datos adicionales"]
["TipoContrato","TipoContrato","TipoIdentificacion","Tipo Identificacion","NumeroIdentificacion","Nombre1","Nombre2","Apellido1","Apellido2","ValorTotalOperacion","ObjetoContrato","CodigoCIIU","DESCRIPCION CIIU","Tipo","Numero1","Apendice1","Orientacion1","Numero2","Apendice2","Orientacion2","Placa","Interior","Bloque","DireccionEspecial","CodDpto","Departamento","CodMpio","Municipio"]
[null,null,null,null,null,null,null,null,null,null,null,null,{"$f":"IFERROR(VLOOKUP(L6,CIIU!A:B,2,0),\"\")","v":""}]
[null,null,null,null,null,null,null,null,null,null,null,null,{"$f":"IFERROR(VLOOKUP(L7,CIIU!A:B,2,0),\"\")","v":""}]
[null,null,null,null,null,null,null,null,null,null,null,null,{"$f":"IFERROR(VLOOKUP(L8,CIIU!A:B,2,0),\"\")","v":""}]
[null,null,null,null,null,null,null,null,null,null,null,null,{"$f":"IFERROR(VLOOKUP(L9,CIIU!A:B,2,0),\"\")","v":""}]
[null,null,null,null,null,null,null,null,null,null,null,null,{"$f":"IFERROR(VLOOKUP(L10,CIIU!A:B,2,0),\"\")","v":""}]
[null,null,null,null,null,null,null,null,null,null,null,null,{"$f":"IFERROR(VLOOKUP(L11,CIIU!A:B,2,0),\"\")","v":""}]
[null,null,null,null,null,null,null,null,null,null,null,null,{"$f":"IFERROR(VLOOKUP(L12,CIIU!A:B,2,0),\"\")","v":""}]
[null,null,null,null,null,null,null,null,null,null,null,null,{"$f":"IFERROR(VLOOKUP(L13,CIIU!A:B,2,0),\"\")","v":""}]
[null,null,null,null,null,null,null,null,null,null,null,null,{"$f":"IFERROR(VLOOKUP(L14,CIIU!A:B,2,0),\"\")","v":""}]
[null,null,null,null,null,null,null,null,null,null,null,null,{"$f":"IFERROR(VLOOKUP(L15,CIIU!A:B,2,0),\"\")","v":""}]
[null,null,null,null,null,null,null,null,null,null,null,null,{"$f":"IFERROR(VLOOKUP(L16,CIIU!A:B,2,0),\"\")","v":""}]
[null,null,null,null,null,null,null,null,null,null,null,null,{"$f":"IFERROR(VLOOKUP(L17,CIIU!A:B,2,0),\"\")","v":""}]
[null,null,null,null,null,null,null,null,null,null,null,null,{"$f":"IFERROR(VLOOKUP(L18,CIIU!A:B,2,0),\"\")","v":""}]
[null,null,null,null,null,null,null,null,null,null,null,null,{"$f":"IFERROR(VLOOKUP(L19,CIIU!A:B,2,0),\"\")","v":""}]
[null,null,null,null,null,null,null,null,null,null,null,null,{"$f":"IFERROR(VLOOKUP(L20,CIIU!A:B,2,0),\"\")","v":""}]
[null,null,null,null,null,null,null,null,null,null,null,null,{"$f":"IFERROR(VLOOKUP(L21,CIIU!A:B,2,0),\"\")","v":""}]
[null,null,null,null,null,null,null,null,null,null,null,null,{"$f":"IFERROR(VLOOKUP(L22,CIIU!A:B,2,0),\"\")","v":""}]
[null,null,null,null,null,null,null,null,null,null,null,null,{"$f":"IFERROR(VLOOKUP(L23,CIIU!A:B,2,0),\"\")","v":""}]
[null,null,null,null,null,null,null,null,null,null,null,null,{"$f":"IFERROR(VLOOKUP(L24,CIIU!A:B,2,0),\"\")","v":""}]
[null,null,null,null,null,null,null,null,null,null,null,null,{"$f":"IFERROR(VLOOKUP(L25,CIIU!A:B,2,0),\"\")","v":""}]
[null,null,null,null,null,null,null,null,null,null,null,null,{"$f":"IFERROR(VLOOKUP(L26,CIIU!A:B,2,0),\"\")","v":""}]
[null,null,null,null,null,null,null,null,null,null,null,null,{"$f":"IFERROR(VLOOKUP(L27,CIIU!A:B,2,0),\"\")","v":""}]
[null,null,null,null,null,null,null,null,null,null,null,null,{"$f":"IFERROR(VLOOKUP(L28,CIIU!A:B,2,0),\"\")","v":""}]
[null,null,null,null,null,null,null,null,null,null,null,null,{"$f":"IFERROR(VLOOKUP(L29,CIIU!A:B,2,0),\"\")","v":""}]
[null,null,null,null,null,null,null,null,null,null,null,null,{"$f":"IFERROR(VLOOKUP(L30,CIIU!A:B,2,0),\"\")","v":""}]
[null,null,null,null,null,null,null,null,null,null,null,null,{"$f":"IFERROR(VLOOKUP(L31,CIIU!A:B,2,0),\"\")","v":""}]
[null,null,null,null,null,null,null,null,null,null,null,null,{"$f":"IFERROR(VLOOKUP(L32,CIIU!A:B,2,0),\"\")","v":""}]
[null,null,null,null,null,null,null,null,null,null,null,null,{"$f":"IFERROR(VLOOKUP(L33,CIIU!A:B,2,0),\"\")","v":""}]
[null,null,null,null,null,null,null,null,null,null,null,null,{"$f":"IFERROR(VLOOKUP(L34,CIIU!A:B,2,0),\"\")","v":""}]
[null,null,null,null,null,null,null,null,null,null,null,null,{"$f":"IFERROR(VLOOKUP(L35,CIIU!A:B,2,0),\"\")","v":""}]
[null,null,null,null,null,null,null,null,null,null,null,null,{"$f":"IFERROR(VLOOKUP(L36,CIIU!A:B,2,0),\"\")","v":""}]
[null,null,null,null,null,null,null,null,null,null,null,null,{"$f":"IFERROR(VLOOKUP(L37,CIIU!A:B,2,0),\"\")","v":""}]
[null,null,null,null,null,null,null,null,null,null,null,null,{"$f":"IFERROR(VLOOKUP(L38,CIIU!A:B,2,0),\"\")","v":""}]
[null,null,null,null,null,null,null,null,null,null,null,null,{"$f":"IFERROR(VLOOKUP(L39,CIIU!A:B,2,0),\"\")","v":""}]
[null,null,null,null,null,null,null,null,null,null,null,null,{"$f":"IFERROR(VLOOKUP(L40,CIIU!A:B,2,0),\"\")","v":""}]
[null,null,null,null,null,null,null,null,null,null,null,null,{"$f":"IFERROR(VLOOKUP(L41,CIIU!A:B,2,0),\"\")","v":""}]
[null,null,null,null,null,null,null,null,null,null,null,null,{"$f":"IFERROR(VLOOKUP(L42,CIIU!A:B,2,0),\"\")","v":""}]
[null,null,null,null,null,null,null,null,null,null,null,null,{"$f":"IFERROR(VLOOKUP(L43,CIIU!A:B,2,0),\"\")","v":""}]
[null,null,null,null,null,null,null,null,null,null,null,null,{"$f":"IFERROR(VLOOKUP(L44,CIIU!A:B,2,0),\"\")","v":""}]
[null,null,null,null,null,null,null,null,null,null,null,null,{"$f":"IFERROR(VLOOKUP(L45,CIIU!A:B,2,0),\"\")","v":""}]
[null,null,null,null,null,null,null,null,null,null,null,null,{"$f":"IFERROR(VLOOKUP(L46,CIIU!A:B,2,0),\"\")","v":""}]
[null,null,null,null,null,null,null,null,null,null,null,null,{"$f":"IFERROR(VLOOKUP(L47,CIIU!A:B,2,0),\"\")","v":""}]
[null,null,null,null,null,null,null,null,null,null,null,null,{"$f":"IFERROR(VLOOKUP(L48,CIIU!A:B,2,0),\"\")","v":""}]
[null,null,null,null,null,null,null,null,null,null,null,null,{"$f":"IFERROR(VLOOKUP(L49,CIIU!A:B,2,0),\"\")","v":""}]
[null,null,null,null,null,null,null,null,null,null,null,null,{"$f":"IFERROR(VLOOKUP(L50,CIIU!A:B,2,0),\"\")","v":""}]
[null,null,null,null,null,null,null,null,null,null,null,null,{"$f":"IFERROR(VLOOKUP(L51,CIIU!A:B,2,0),\"\")","v":""}]
[null,null,null,null,null,null,null,null,null,null,null,null,{"$f":"IFERROR(VLOOKUP(L52,CIIU!A:B,2,0),\"\")","v":""}]
[null,null,null,null,null,null,null,null,null,null,null,null,{"$f":"IFERROR(VLOOKUP(L53,CIIU!A:B,2,0),\"\")","v":""}]
[null,null,null,null,null,null,null,null,null,null,null,null,{"$f":"IFERROR(VLOOKUP(L54,CIIU!A:B,2,0),\"\")","v":""}]
[null,null,null,null,null,null,null,null,null,null,null,null,{"$f":"IFERROR(VLOOKUP(L55,CIIU!A:B,2,0),\"\")","v":""}]
[null,null,null,null,null,null,null,null,null,null,null,null,{"$f":"IFERROR(VLOOKUP(L56,CIIU!A:B,2,0),\"\")","v":""}]
[null,null,null,null,null,null,null,null,null,null,null,null,{"$f":"IFERROR(VLOOKUP(L57,CIIU!A:B,2,0),\"\")","v":""}]
[null,null,null,null,null,null,null,null,null,null,null,null,{"$f":"IFERROR(VLOOKUP(L58,CIIU!A:B,2,0),\"\")","v":""}]
[null,null,null,null,null,null,null,null,null,null,null,null,{"$f":"IFERROR(VLOOKUP(L59,CIIU!A:B,2,0),\"\")","v":""}]
[null,null,null,null,null,null,null,null,null,null,null,null,{"$f":"IFERROR(VLOOKUP(L60,CIIU!A:B,2,0),\"\")","v":""}]
[null,null,null,null,null,null,null,null,null,null,null,null,{"$f":"IFERROR(VLOOKUP(L61,CIIU!A:B,2,0),\"\")","v":""}]
[null,null,null,null,null,null,null,null,null,null,null,null,{"$f":"IFERROR(VLOOKUP(L62,CIIU!A:B,2,0),\"\")","v":""}]
[null,null,null,null,null,null,null,null,null,null,null,null,{"$f":"IFERROR(VLOOKUP(L63,CIIU!A:B,2,0),\"\")","v":""}]
[null,null,null,null,null,null,null,null,null,null,null,null,{"$f":"IFERROR(VLOOKUP(L64,CIIU!A:B,2,0),\"\")","v":""}]
[null,null,null,null,null,null,null,null,null,null,null,null,{"$f":"IFERROR(VLOOKUP(L65,CIIU!A:B,2,0),\"\")","v":""}]
[null,null,null,null,null,null,null,null,null,null,null,null,{"$f":"IFERROR(VLOOKUP(L66,CIIU!A:B,2,0),\"\")","v":""}]
[null,null,null,null,null,null,null,null,null,null,null,null,{"$f":"IFERROR(VLOOKUP(L67,CIIU!A:B,2,0),\"\")","v":""}]
[null,null,null,null,null,null,null,null,null,null,null,null,{"$f":"IFERROR(VLOOKUP(L68,CIIU!A:B,2,0),\"\")","v":""}]
[null,null,null,null,null,null,null,null,null,null,null,null,{"$f":"IFERROR(VLOOKUP(L69,CIIU!A:B,2,0),\"\")","v":""}]
[null,null,null,null,null,null,null,null,null,null,null,null,{"$f":"IFERROR(VLOOKUP(L70,CIIU!A:B,2,0),\"\")","v":""}]
[null,null,null,null,null,null,null,null,null,null,null,null,{"$f":"IFERROR(VLOOKUP(L71,CIIU!A:B,2,0),\"\")","v":""}]
[null,null,null,null,null,null,null,null,null,null,null,null,{"$f":"IFERROR(VLOOKUP(L72,CIIU!A:B,2,0),\"\")","v":""}]
[null,null,null,null,null,null,null,null,null,null,null,null,{"$f":"IFERROR(VLOOKUP(L73,CIIU!A:B,2,0),\"\")","v":""}]
[null,null,null,null,null,null,null,null,null,null,null,null,{"$f":"IFERROR(VLOOKUP(L74,CIIU!A:B,2,0),\"\")","v":""}]
[null,null,null,null,null,null,null,null,null,null,null,null,{"$f":"IFERROR(VLOOKUP(L75,CIIU!A:B,2,0),\"\")","v":""}]
[null,null,null,null,null,null,null,null,null,null,null,null,{"$f":"IFERROR(VLOOKUP(L76,CIIU!A:B,2,0),\"\")","v":""}]
[null,null,null,null,null,null,null,null,null,null,null,null,{"$f":"IFERROR(VLOOKUP(L77,CIIU!A:B,2,0),\"\")","v":""}]
[null,null,null,null,null,null,null,null,null,null,null,null,{"$f":"IFERROR(VLOOKUP(L78,CIIU!A:B,2,0),\"\")","v":""}]
[null,null,null,null,null,null,null,null,null,null,null,null,{"$f":"IFERROR(VLOOKUP(L79,CIIU!A:B,2,0),\"\")","v":""}]
[null,null,null,null,null,null,null,null,null,null,null,null,{"$f":"IFERROR(VLOOKUP(L80,CIIU!A:B,2,0),\"\")","v":""}]
{"$rows_left_out":1924}
{"sheet":"LogErrores","index":2,"n_rows":1,"n_cols":1,"rows_kept":1,"cut":false,"hidden":false,"merged":[]}
["Descripción de los errores generados en la validación de los contratos de colaboración empresarial"]

{"sheet":"TiposContrato","index":3,"n_rows":8,"n_cols":3,"rows_kept":8,"cut":false,"hidden":true,"merged":[]}
["ID","TIPO","ID"]
[1,"Consorcio",1]
[2,"Unión temporal",2]
[3,"Contrato de mandato",3]
[4,"Administración delegada",4]
[5,"Joint venture",5]
[6,"Cuentas en participación",6]
[7,"Convenios de cooperación",7]

{"sheet":"Tipos Documento identidad","index":4,"n_rows":8,"n_cols":3,"rows_kept":8,"cut":false,"hidden":true,"merged":[[0,0,0,1]]}
["Tipos de documento"]
["Id","Tipo documento"]
["1","NIT","1"]
["2","Cédula de ciudadanía","2"]
["3","Cédula de extranjería","3"]
["4","Pasaporte","4"]
["5","Tarjeta de identidad","5"]
["6","Otros","6"]

{"sheet":"CIIU","index":5,"n_rows":558,"n_cols":3,"rows_kept":558,"cut":false,"hidden":true,"merged":[]}
["Código","Descripción","Código"]
[510,"Extracción de hulla (carbón de piedra)",510]
[520,"Extracción de carbón lignito",520]
[610,"Extracción de petróleo crudo",610]
[620,"Extracción de gas natural",620]
[710,"Extracción de minerales de hierro",710]
[721,"Extracción de minerales de uranio y de torio",721]
[722,"Extracción de oro y otros metales preciosos",722]
[723,"Extracción de minerales de níquel",723]
[729,"Extracción de otros minerales metalíferos no ferrosos n.c.p.",729]
[811,"Extracción de piedra, arena, arcillas comunes, yeso y anhidrita",811]
[812,"Extracción de arcillas de uso industrial, caliza, caolín y bentonitas",812]
[820,"Extracción de esmeraldas, piedras preciosas y semipreciosas",820]
[891,"Extracción de minerales para la fabricación de abonos y productos químicos",891]
[892,"Extracción de halita (sal)",892]
[899,"Extracción de otros minerales no metálicos n.c.p.",899]
[1011,"Procesamiento y conservación de carne y productos cárnicos",1011]
[1012,"Procesamiento y conservación de pescados, crustáceos y moluscos",1012]
[1020,"Procesamiento y conservación de frutas, legumbres, hortalizas y tubérculos",1020]
[1030,"Elaboración de aceites y grasas de origen vegetal y animal",1030]
[1040,"Elaboración de productos lácteos",1040]
[1051,"Elaboración de productos de molinería",1051]
[1052,"Elaboración de almidones y productos derivados del almidón",1052]
[1061,"Trilla de café",1061]
[1062,"Descafeinado, tostión y molienda del café",1062]
[1063,"Otros derivados del café",1063]
[1071,"Elaboración y refinación de azúcar",1071]
[1072,"Elaboración de panela",1072]
[1081,"Elaboración de productos de panadería",1081]
[1082,"Elaboración de cacao, chocolate y productos de confitería",1082]
[1083,"Elaboración de macarrones, fideos, alcuzcuz y productos farináceos similares",1083]
[1084,"Elaboración de comidas y platos preparados",1084]
[1089,"Elaboración de otros productos alimenticios n.c.p.",1089]
[1090,"Elaboración de alimentos preparados para animales",1090]
[1101,"Destilación, rectificación y mezcla de bebidas alcohólicas",1101]
[1102,"Elaboración de bebidas fermentadas no destiladas",1102]
[1103,"Producción de malta, elaboración de cervezas y otras bebidas malteadas",1103]
["1103A","Producción de malta, elaboración de cervezas y otras bebidas malteadas sin alcohol","1103A"]
["1103B","Producción de malta, elaboración de cervezas y otras bebidas malteadas que tengan algún grado de alcohol","1103B"]
[1104,"Elaboración de bebidas no alcohólicas, producción de aguas minerales y de otras aguas embotelladas",1104]
[1200,"Elaboración de productos de tabaco",1200]
[1311,"Preparación e hilatura de fibras textiles",1311]
[1312,"Tejeduría de productos textiles",1312]
[1313,"Acabado de productos textiles",1313]
[1391,"Fabricación de tejidos de punto y ganchillo",1391]
[1392,"Confección de artículos con materiales textiles, excepto prendas de vestir",1392]
[1393,"Fabricación de tapetes y alfombras para pisos",1393]
[1394,"Fabricación de cuerdas, cordeles, cables, bramantes y redes",1394]
[1399,"Fabricación de otros artículos textiles n.c.p.",1399]
[1410,"Confección de prendas de vestir, excepto prendas de piel",1410]
[1420,"Fabricación de artículos de piel",1420]
[1430,"Fabricación de artículos de punto y ganchillo",1430]
[1511,"Curtido y recurtido de cueros; recurtido y teñido de pieles",1511]
[1512,"Fabricación de artículos de viaje, bolsos de mano y artículos similares elaborados en cuero, y fabricación de artículos de talabartería y guarnicionería",1512]
[1513,"Fabricación de artículos de viaje, bolsos de mano y artículos similares; artículos de talabartería y guarnicionería elaborados en otros materiales",1513]
[1521,"Fabricación de calzado de cuero y piel, con cualquier tipo de suela",1521]
[1522,"Fabricación de otros tipos de calzado, excepto calzado de cuero y piel",1522]
[1523,"Fabricación de partes del calzado",1523]
[1610,"Aserrado, acepillado e impregnación de la madera",1610]
[1620,"Fabricación de hojas de madera para enchapado; fabricación de tableros contrachapados, tableros laminados, tableros de partículas y otros tableros y paneles",1620]
[1630,"Fabricación de partes y piezas de madera, de carpintería y ebanistería para la construcción",1630]
[1640,"Fabricación de recipientes de madera",1640]
[1690,"Fabricación de otros productos de madera; fabricación de artículos de corcho, cestería y espartería",1690]
[1701,"Fabricación de pulpas (pastas) celulósicas; papel y cartón",1701]
[1702,"Fabricación de papel y cartón ondulado (corrugado); fabricación de envases, empaques y de  embalajes de papel y cartón",1702]
[1709,"Fabricación de otros artículos de papel y cartón",1709]
[1811,"Tipografía y artes graficas",1811]
[1812,"Actividades de servicios relacionados con la impresión",1812]
[1910,"Fabricación de productos de hornos de coque",1910]
[1921,"Fabricación de productos de la refinación del petróleo",1921]
[1922,"Actividad de mezcla de combustibles",1922]
[2011,"Fabricación de sustancias y productos químicos básicos",2011]
[2012,"Fabricación de abonos y compuestos inorgánicos nitrogenados",2012]
[2013,"Fabricación de plásticos en formas primarias",2013]
[2014,"Fabricación de caucho sintético en formas primarias",2014]
[2021,"Fabricación de plaguicidas y otros productos químicos de uso agropecuario",2021]
[2022,"Fabricación de pinturas, barnices y revestimientos similares, tintas para impresión y masillas",2022]
[2023,"Fabricación de jabones y detergentes, preparados para limpiar y pulir; perfumes y preparados  de tocador",2023]
[2029,"Fabricación de otros productos químicos n.c.p.",2029]
[2030,"Fabricación de fibras sintéticas y artificiales",2030]
{"$rows_left_out":479}
{"sheet":"Departamentos - Municipios","index":6,"n_rows":1160,"n_cols":6,"rows_kept":1160,"cut":false,"hidden":true,"merged":[[1,0,3,0],[1,1,3,1],[1,3,3,3],[1,4,3,4]]}
["Fuente información: Listado de departamentos y Municipios DANE, https://www.dane.gov.co/files/censos/.../NBI_total_cab_resto_mpio_nal_31dic08.xls"]
["Código Departamento","Nombre Departamento",null,"Código Municipio","Nombre Municipio"]
[]
[]
["05","ANTIOQUIA","05","05001","MEDELLIN",{"$f":"D5","v":"05001"}]
["05","ANTIOQUIA","05","05002","ABEJORRAL",{"$f":"D6","v":"05002"}]
["05","ANTIOQUIA","05","05004","ABRIAQUI","05004"]
["05","ANTIOQUIA","05","05021","ALEJANDRIA","05021"]
["05","ANTIOQUIA","05","05030","AMAGA","05030"]
["05","ANTIOQUIA","05","05031","AMALFI","05031"]
["05","ANTIOQUIA","05","05034","ANDES","05034"]
["05","ANTIOQUIA","05","05036","ANGELOPOLIS","05036"]
["05","ANTIOQUIA","05","05038","ANGOSTURA","05038"]
["05","ANTIOQUIA","05","05040","ANORI","05040"]
["05","ANTIOQUIA","05","05042","SANTAFE DE ANTIOQUIA","05042"]
["05","ANTIOQUIA","05","05044","ANZA","05044"]
["05","ANTIOQUIA","05","05045","APARTADO","05045"]
["05","ANTIOQUIA","05","05051","ARBOLETES","05051"]
["05","ANTIOQUIA","05","05055","ARGELIA","05055"]
["05","ANTIOQUIA","05","05059","ARMENIA","05059"]
["05","ANTIOQUIA","05","05079","BARBOSA","05079"]
["05","ANTIOQUIA","05","05086","BELMIRA","05086"]
["05","ANTIOQUIA","05","05088","BELLO","05088"]
["05","ANTIOQUIA","05","05091","BETANIA","05091"]
["05","ANTIOQUIA","05","05093","BETULIA","05093"]
["05","ANTIOQUIA","05","05101","CIUDAD BOLIVAR","05101"]
["05","ANTIOQUIA","05","05107","BRICEÑO","05107"]
["05","ANTIOQUIA","05","05113","BURITICA","05113"]
["05","ANTIOQUIA","05","05120","CACERES","05120"]
["05","ANTIOQUIA","05","05125","CAICEDO","05125"]
["05","ANTIOQUIA","05","05129","CALDAS","05129"]
["05","ANTIOQUIA","05","05134","CAMPAMENTO","05134"]
["05","ANTIOQUIA","05","05138","CAÑASGORDAS","05138"]
["05","ANTIOQUIA","05","05142","CARACOLI","05142"]
["05","ANTIOQUIA","05","05145","CARAMANTA","05145"]
["05","ANTIOQUIA","05","05147","CAREPA","05147"]
["05","ANTIOQUIA","05","05148","EL CARMEN DE VIBORAL","05148"]
["05","ANTIOQUIA","05","05150","CAROLINA","05150"]
["05","ANTIOQUIA","05","05154","CAUCASIA","05154"]
["05","ANTIOQUIA","05","05172","CHIGORODO","05172"]
["05","ANTIOQUIA","05","05190","CISNEROS","05190"]
["05","ANTIOQUIA","05","05197","COCORNA","05197"]
["05","ANTIOQUIA","05","05206","CONCEPCION","05206"]
["05","ANTIOQUIA","05","05209","CONCORDIA","05209"]
["05","ANTIOQUIA","05","05212","COPACABANA","05212"]
["05","ANTIOQUIA","05","05234","DABEIBA","05234"]
["05","ANTIOQUIA","05","05237","DON MATIAS","05237"]
["05","ANTIOQUIA","05","05240","EBEJICO","05240"]
["05","ANTIOQUIA","05","05250","EL BAGRE","05250"]
["05","ANTIOQUIA","05","05264","ENTRERRIOS","05264"]
["05","ANTIOQUIA","05","05266","ENVIGADO","05266"]
["05","ANTIOQUIA","05","05282","FREDONIA","05282"]
["05","ANTIOQUIA","05","05284","FRONTINO","05284"]
["05","ANTIOQUIA","05","05306","GIRALDO","05306"]
["05","ANTIOQUIA","05","05308","GIRARDOTA","05308"]
["05","ANTIOQUIA","05","05310","GOMEZ PLATA","05310"]
["05","ANTIOQUIA","05","05313","GRANADA","05313"]
["05","ANTIOQUIA","05","05315","GUADALUPE","05315"]
["05","ANTIOQUIA","05","05318","GUARNE","05318"]
["05","ANTIOQUIA","05","05321","GUATAPE","05321"]
["05","ANTIOQUIA","05","05347","HELICONIA","05347"]
["05","ANTIOQUIA","05","05353","HISPANIA","05353"]
["05","ANTIOQUIA","05","05360","ITAGUI","05360"]
["05","ANTIOQUIA","05","05361","ITUANGO","05361"]
["05","ANTIOQUIA","05","05364","JARDIN","05364"]
["05","ANTIOQUIA","05","05368","JERICO","05368"]
["05","ANTIOQUIA","05","05376","LA CEJA","05376"]
["05","ANTIOQUIA","05","05380","LA ESTRELLA","05380"]
["05","ANTIOQUIA","05","05390","LA PINTADA","05390"]
["05","ANTIOQUIA","05","05400","LA UNION",{"$f":"D70","v":"05400"}]
["05","ANTIOQUIA","05","05411","LIBORINA","05411"]
["05","ANTIOQUIA","05","05425","MACEO","05425"]
["05","ANTIOQUIA","05","05440","MARINILLA","05440"]
["05","ANTIOQUIA","05","05467","MONTEBELLO","05467"]
["05","ANTIOQUIA","05","05475","MURINDO","05475"]
["05","ANTIOQUIA","05","05480","MUTATA","05480"]
["05","ANTIOQUIA","05","05483","NARIÑO","05483"]
["05","ANTIOQUIA","05","05490","NECOCLI","05490"]
["05","ANTIOQUIA","05","05495","NECHI","05495"]
["05","ANTIOQUIA","05","05501","OLAYA","05501"]
{"$rows_left_out":1080}